{"text_format":"1","workbook":"xlsx","n_sheets":7,"sheets":["Directions","Summary","CashFlow % (Actual = Budget)","CashFlow %","CashFlow Projection Yr","CashFlow PY","CashFlow Second PY"],"not_rendered":{"charts":0,"images":10,"macros":1,"external_links":0,"defined_names":6,"comments":1,"pivot_tables":0},"unopened":[],"bounds":{"document_bytes":16777216,"sheet_cells":100000,"rows_first":2000,"rows_last":500,"rows_between":2000,"halvings":0,"cell_chars":16384,"cell_head_chars":4096},"cells_cut":0,"cells_raw":0,"read":"whole","date_system":"1900"}

{"sheet":"Directions","index":0,"n_rows":259,"n_cols":7,"rows_kept":259,"cut":false,"hidden":false,"merged":[[243,0,243,2],[0,0,0,8],[231,1,231,8],[237,0,237,1],[1,0,1,1],[233,1,233,8],[227,1,227,8],[229,1,229,8],[228,1,228,8],[225,0,225,2]]}
["The use of this CashFlow Worksheet begins with uploading data from the Everest Cash Flow Report CSV file export for the current fiscal year and the prior 2 fiscal years."]
["SETUP"]
[1,"Log into the Everest Desktop Application and navigate to the Finance section"]
[2,"Ensure that the current fiscal year is selected in the bottom right corner"]
[3,"Within the Reports menu >> Expand the GL folder >> Select the Cash Flow Report option"]
[]
{"$rows_left_out":254}
{"sheet":"Summary","index":1,"n_rows":67,"n_cols":19,"rows_kept":67,"cut":false,"hidden":false,"merged":[[6,0,6,9],[7,0,7,9],[8,0,8,9],[9,0,9,9],[6,10,6,15],[7,10,7,15],[8,10,8,15],[9,10,9,15]]}
["District Name:","District Name"]
["Fiscal Year: ","Fiscal Year/Report Period"]
["Cash Flow Actuals Through:","None"]
["Apportionment Calculation: ","Type 1"]
["Receipt Actual Totals = Budget Totals:","No"]
["Disbursement Actual Totals = Budget Totals:","Yes"]
{"$rows_left_out":62}
{"sheet":"CashFlow % (Actual = Budget)","index":2,"n_rows":45,"n_cols":16,"rows_kept":45,"cut":false,"hidden":true,"merged":[]}
[{"$f":"'CashFlow %'!A1","v":"ObjectText"},{"$f":"'CashFlow %'!B1","v":"Title"},{"$f":"'CashFlow %'!C1","v":"Beg Balance"},{"$f":"'CashFlow %'!D1","v":"July"},{"$f":"'CashFlow %'!E1","v":"August"},{"$f":"'CashFlow %'!F1","v":"September"},{"$f":"'CashFlow %'!G1","v":"October"},{"$f":"'CashFlow %'!H1","v":"November"},{"$f":"'CashFlow %'!I1","v":"December"},{"$f":"'CashFlow %'!J1","v":"January"},{"$f":"'CashFlow %'!K1","v":"February"},{"$f":"'CashFlow %'!L1","v":"March"},{"$f":"'CashFlow %'!M1","v":"April"},{"$f":"'CashFlow %'!N1","v":"May"},{"$f":"'CashFlow %'!O1","v":"June"},"Total"]
[{"$f":"'CashFlow %'!A2","v":9110},{"$f":"'CashFlow %'!B2","v":"A.  BEGINNING CASH"},{"$f":"'CashFlow %'!C2","v":0}]
[null,{"$f":"'CashFlow %'!B3","v":"B.  RECEIPTS"}]
[{"$f":"'CashFlow %'!A4","v":"8010-8019"},{"$f":"'CashFlow %'!B4","v":"     Principal Apportionment"},null,{"$f":"IF(VLOOKUP(D$1,Table1[[Month]:[Actuals Month]],3,FALSE),'CashFlow %'!D4,IF('CashFlow %'!$P4 <> 1,(1-'CashFlow %'!$P4)*IFERROR('CashFlow %'!D4/'CashFlow %'!$P4,0),0)+'CashFlow %'!D4)","v":0},{"$f":"IF(VLOOKUP(E$1,Table1[[Month]:[Actuals Month]],3,FALSE),'CashFlow %'!E4,IF('CashFlow %'!$P4 <> 1,(1-'CashFlow %'!$P4)*IFERROR('CashFlow %'!E4/'CashFlow %'!$P4,0),0)+'CashFlow %'!E4)","v":0},{"$f":"IF(VLOOKUP(F$1,Table1[[Month]:[Actuals Month]],3,FALSE),'CashFlow %'!F4,IF('CashFlow %'!$P4 <> 1,(1-'CashFlow %'!$P4)*IFERROR('CashFlow %'!F4/'CashFlow %'!$P4,0),0)+'CashFlow %'!F4)","v":0},{"$f":"IF(VLOOKUP(G$1,Table1[[Month]:[Actuals Month]],3,FALSE),'CashFlow %'!G4,IF('CashFlow %'!$P4 <> 1,(1-'CashFlow %'!$P4)*IFERROR('CashFlow %'!G4/'CashFlow %'!$P4,0),0)+'CashFlow %'!G4)","v":0},{"$f":"IF(VLOOKUP(H$1,Table1[[Month]:[Actuals Month]],3,FALSE),'CashFlow %'!H4,IF('CashFlow %'!$P4 <> 1,(1-'CashFlow %'!$P4)*IFERROR('CashFlow %'!H4/'CashFlow %'!$P4,0),0)+'CashFlow %'!H4)","v":0},{"$f":"IF(VLOOKUP(I$1,Table1[[Month]:[Actuals Month]],3,FALSE),'CashFlow %'!I4,IF('CashFlow %'!$P4 <> 1,(1-'CashFlow %'!$P4)*IFERROR('CashFlow %'!I4/'CashFlow %'!$P4,0),0)+'CashFlow %'!I4)","v":0},{"$f":"IF(VLOOKUP(J$1,Table1[[Month]:[Actuals Month]],3,FALSE),'CashFlow %'!J4,IF('CashFlow %'!$P4 <> 1,(1-'CashFlow %'!$P4)*IFERROR('CashFlow %'!J4/'CashFlow %'!$P4,0),0)+'CashFlow %'!J4)","v":0},{"$f":"IF(VLOOKUP(K$1,Table1[[Month]:[Actuals Month]],3,FALSE),'CashFlow %'!K4,IF('CashFlow %'!$P4 <> 1,(1-'CashFlow %'!$P4)*IFERROR('CashFlow %'!K4/'CashFlow %'!$P4,0),0)+'CashFlow %'!K4)","v":0},{"$f":"IF(VLOOKUP(L$1,Table1[[Month]:[Actuals Month]],3,FALSE),'CashFlow %'!L4,IF('CashFlow %'!$P4 <> 1,(1-'CashFlow %'!$P4)*IFERROR('CashFlow %'!L4/'CashFlow %'!$P4,0),0)+'CashFlow %'!L4)","v":0},{"$f":"IF(VLOOKUP(M$1,Table1[[Month]:[Actuals Month]],3,FALSE),'CashFlow %'!M4,IF('CashFlow %'!$P4 <> 1,(1-'CashFlow %'!$P4)*IFERROR('CashFlow %'!M4/'CashFlow %'!$P4,0),0)+'CashFlow %'!M4)","v":0},{"$f":"IF(VLOOKUP(N$1,Table1[[Month]:[Actuals Month]],3,FALSE),'CashFlow %'!N4,IF('CashFlow %'!$P4 <> 1,(1-'CashFlow %'!$P4)*IFERROR('CashFlow %'!N4/'CashFlow %'!$P4,0),0)+'CashFlow %'!N4)","v":0},{"$f":"IF(VLOOKUP(O$1,Table1[[Month]:[Actuals Month]],3,FALSE),'CashFlow %'!O4,IF('CashFlow %'!$P4 <> 1,(1-'CashFlow %'!$P4)*IFERROR('CashFlow %'!O4/'CashFlow %'!$P4,0),0)+'CashFlow %'!O4)","v":0},{"$f":"SUM(IF(ReportingPeriod = \"NONE\", $D4:$O4,IF(ReportingPeriod = \"June\",0, INDIRECT(ADDRESS(ROW(),MATCH(ReportingPeriod,$D$1:$O$1,0)+4,3)):$O4)))","v":0}]
[{"$f":"'CashFlow %'!A5","v":"8020-8079"},{"$f":"'CashFlow %'!B5","v":"     Property Taxes"},null,{"$f":"IF(VLOOKUP(D$1,Table1[[Month]:[Actuals Month]],3,FALSE),'CashFlow %'!D5,IF('CashFlow %'!$P5 <> 1,(1-'CashFlow %'!$P5)*IFERROR('CashFlow %'!D5/'CashFlow %'!$P5,0),0)+'CashFlow %'!D5)","v":0},{"$f":"IF(VLOOKUP(E$1,Table1[[Month]:[Actuals Month]],3,FALSE),'CashFlow %'!E5,IF('CashFlow %'!$P5 <> 1,(1-'CashFlow %'!$P5)*IFERROR('CashFlow %'!E5/'CashFlow %'!$P5,0),0)+'CashFlow %'!E5)","v":0},{"$f":"IF(VLOOKUP(F$1,Table1[[Month]:[Actuals Month]],3,FALSE),'CashFlow %'!F5,IF('CashFlow %'!$P5 <> 1,(1-'CashFlow %'!$P5)*IFERROR('CashFlow %'!F5/'CashFlow %'!$P5,0),0)+'CashFlow %'!F5)","v":0},{"$f":"IF(VLOOKUP(G$1,Table1[[Month]:[Actuals Month]],3,FALSE),'CashFlow %'!G5,IF('CashFlow %'!$P5 <> 1,(1-'CashFlow %'!$P5)*IFERROR('CashFlow %'!G5/'CashFlow %'!$P5,0),0)+'CashFlow %'!G5)","v":0},{"$f":"IF(VLOOKUP(H$1,Table1[[Month]:[Actuals Month]],3,FALSE),'CashFlow %'!H5,IF('CashFlow %'!$P5 <> 1,(1-'CashFlow %'!$P5)*IFERROR('CashFlow %'!H5/'CashFlow %'!$P5,0),0)+'CashFlow %'!H5)","v":0},{"$f":"IF(VLOOKUP(I$1,Table1[[Month]:[Actuals Month]],3,FALSE),'CashFlow %'!I5,IF('CashFlow %'!$P5 <> 1,(1-'CashFlow %'!$P5)*IFERROR('CashFlow %'!I5/'CashFlow %'!$P5,0),0)+'CashFlow %'!I5)","v":0},{"$f":"IF(VLOOKUP(J$1,Table1[[Month]:[Actuals Month]],3,FALSE),'CashFlow %'!J5,IF('CashFlow %'!$P5 <> 1,(1-'CashFlow %'!$P5)*IFERROR('CashFlow %'!J5/'CashFlow %'!$P5,0),0)+'CashFlow %'!J5)","v":0},{"$f":"IF(VLOOKUP(K$1,Table1[[Month]:[Actuals Month]],3,FALSE),'CashFlow %'!K5,IF('CashFlow %'!$P5 <> 1,(1-'CashFlow %'!$P5)*IFERROR('CashFlow %'!K5/'CashFlow %'!$P5,0),0)+'CashFlow %'!K5)","v":0},{"$f":"IF(VLOOKUP(L$1,Table1[[Month]:[Actuals Month]],3,FALSE),'CashFlow %'!L5,IF('CashFlow %'!$P5 <> 1,(1-'CashFlow %'!$P5)*IFERROR('CashFlow %'!L5/'CashFlow %'!$P5,0),0)+'CashFlow %'!L5)","v":0},{"$f":"IF(VLOOKUP(M$1,Table1[[Month]:[Actuals Month]],3,FALSE),'CashFlow %'!M5,IF('CashFlow %'!$P5 <> 1,(1-'CashFlow %'!$P5)*IFERROR('CashFlow %'!M5/'CashFlow %'!$P5,0),0)+'CashFlow %'!M5)","v":0},{"$f":"IF(VLOOKUP(N$1,Table1[[Month]:[Actuals Month]],3,FALSE),'CashFlow %'!N5,IF('CashFlow %'!$P5 <> 1,(1-'CashFlow %'!$P5)*IFERROR('CashFlow %'!N5/'CashFlow %'!$P5,0),0)+'CashFlow %'!N5)","v":0},{"$f":"IF(VLOOKUP(O$1,Table1[[Month]:[Actuals Month]],3,FALSE),'CashFlow %'!O5,IF('CashFlow %'!$P5 <> 1,(1-'CashFlow %'!$P5)*IFERROR('CashFlow %'!O5/'CashFlow %'!$P5,0),0)+'CashFlow %'!O5)","v":0},{"$f":"SUM(IF(ReportingPeriod = \"NONE\", $D5:$O5,IF(ReportingPeriod = \"June\",0, INDIRECT(ADDRESS(ROW(),MATCH(ReportingPeriod,$D$1:$O$1,0)+4,3)):$O5)))","v":0}]
[{"$f":"'CashFlow %'!A6","v":"8080-8099"},{"$f":"'CashFlow %'!B6","v":"     Misc Funds"},null,{"$f":"IF(VLOOKUP(D$1,Table1[[Month]:[Actuals Month]],3,FALSE),'CashFlow %'!D6,IF('CashFlow %'!$P6 <> 1,(1-'CashFlow %'!$P6)*IFERROR('CashFlow %'!D6/'CashFlow %'!$P6,0),0)+'CashFlow %'!D6)","v":0},{"$f":"IF(VLOOKUP(E$1,Table1[[Month]:[Actuals Month]],3,FALSE),'CashFlow %'!E6,IF('CashFlow %'!$P6 <> 1,(1-'CashFlow %'!$P6)*IFERROR('CashFlow %'!E6/'CashFlow %'!$P6,0),0)+'CashFlow %'!E6)","v":0},{"$f":"IF(VLOOKUP(F$1,Table1[[Month]:[Actuals Month]],3,FALSE),'CashFlow %'!F6,IF('CashFlow %'!$P6 <> 1,(1-'CashFlow %'!$P6)*IFERROR('CashFlow %'!F6/'CashFlow %'!$P6,0),0)+'CashFlow %'!F6)","v":0},{"$f":"IF(VLOOKUP(G$1,Table1[[Month]:[Actuals Month]],3,FALSE),'CashFlow %'!G6,IF('CashFlow %'!$P6 <> 1,(1-'CashFlow %'!$P6)*IFERROR('CashFlow %'!G6/'CashFlow %'!$P6,0),0)+'CashFlow %'!G6)","v":0},{"$f":"IF(VLOOKUP(H$1,Table1[[Month]:[Actuals Month]],3,FALSE),'CashFlow %'!H6,IF('CashFlow %'!$P6 <> 1,(1-'CashFlow %'!$P6)*IFERROR('CashFlow %'!H6/'CashFlow %'!$P6,0),0)+'CashFlow %'!H6)","v":0},{"$f":"IF(VLOOKUP(I$1,Table1[[Month]:[Actuals Month]],3,FALSE),'CashFlow %'!I6,IF('CashFlow %'!$P6 <> 1,(1-'CashFlow %'!$P6)*IFERROR('CashFlow %'!I6/'CashFlow %'!$P6,0),0)+'CashFlow %'!I6)","v":0},{"$f":"IF(VLOOKUP(J$1,Table1[[Month]:[Actuals Month]],3,FALSE),'CashFlow %'!J6,IF('CashFlow %'!$P6 <> 1,(1-'CashFlow %'!$P6)*IFERROR('CashFlow %'!J6/'CashFlow %'!$P6,0),0)+'CashFlow %'!J6)","v":0},{"$f":"IF(VLOOKUP(K$1,Table1[[Month]:[Actuals Month]],3,FALSE),'CashFlow %'!K6,IF('CashFlow %'!$P6 <> 1,(1-'CashFlow %'!$P6)*IFERROR('CashFlow %'!K6/'CashFlow %'!$P6,0),0)+'CashFlow %'!K6)","v":0},{"$f":"IF(VLOOKUP(L$1,Table1[[Month]:[Actuals Month]],3,FALSE),'CashFlow %'!L6,IF('CashFlow %'!$P6 <> 1,(1-'CashFlow %'!$P6)*IFERROR('CashFlow %'!L6/'CashFlow %'!$P6,0),0)+'CashFlow %'!L6)","v":0},{"$f":"IF(VLOOKUP(M$1,Table1[[Month]:[Actuals Month]],3,FALSE),'CashFlow %'!M6,IF('CashFlow %'!$P6 <> 1,(1-'CashFlow %'!$P6)*IFERROR('CashFlow %'!M6/'CashFlow %'!$P6,0),0)+'CashFlow %'!M6)","v":0},{"$f":"IF(VLOOKUP(N$1,Table1[[Month]:[Actuals Month]],3,FALSE),'CashFlow %'!N6,IF('CashFlow %'!$P6 <> 1,(1-'CashFlow %'!$P6)*IFERROR('CashFlow %'!N6/'CashFlow %'!$P6,0),0)+'CashFlow %'!N6)","v":0},{"$f":"IF(VLOOKUP(O$1,Table1[[Month]:[Actuals Month]],3,FALSE),'CashFlow %'!O6,IF('CashFlow %'!$P6 <> 1,(1-'CashFlow %'!$P6)*IFERROR('CashFlow %'!O6/'CashFlow %'!$P6,0),0)+'CashFlow %'!O6)","v":0},{"$f":"SUM(IF(ReportingPeriod = \"NONE\", $D6:$O6,IF(ReportingPeriod = \"June\",0, INDIRECT(ADDRESS(ROW(),MATCH(ReportingPeriod,$D$1:$O$1,0)+4,3)):$O6)))","v":0}]
{"$rows_left_out":40}
{"sheet":"CashFlow %","index":3,"n_rows":45,"n_cols":16,"rows_kept":45,"cut":false,"hidden":true,"merged":[]}
["ObjectText","Title","Beg Balance","July","August","September","October","November","December","January","February","March","April","May","June","Total"]
[9110,"A.  BEGINNING CASH",{"$f":"'CashFlow Projection Yr'!K2","v":0}]
[null,"B.  RECEIPTS"]
["8010-8019","     Principal Apportionment",null,{"$f":"IF(VLOOKUP(D$1,Table1[[Month]:[Actuals Month]],3,FALSE),'CashFlow Projection Yr'!L4,ABS((IFERROR('CashFlow PY'!L4/'CashFlow PY'!$Z4,0)+IFERROR('CashFlow Second PY'!L4/'CashFlow Second PY'!$Z4,0))/2))","v":0},{"$f":"IF(VLOOKUP(E$1,Table1[[Month]:[Actuals Month]],3,FALSE),'CashFlow Projection Yr'!M4,ABS((IFERROR('CashFlow PY'!M4/'CashFlow PY'!$Z4,0)+IFERROR('CashFlow Second PY'!M4/'CashFlow Second PY'!$Z4,0))/2))","v":0},{"$f":"IF(VLOOKUP(F$1,Table1[[Month]:[Actuals Month]],3,FALSE),'CashFlow Projection Yr'!N4,ABS((IFERROR('CashFlow PY'!N4/'CashFlow PY'!$Z4,0)+IFERROR('CashFlow Second PY'!N4/'CashFlow Second PY'!$Z4,0))/2))","v":0},{"$f":"IF(VLOOKUP(G$1,Table1[[Month]:[Actuals Month]],3,FALSE),'CashFlow Projection Yr'!O4,ABS((IFERROR('CashFlow PY'!O4/'CashFlow PY'!$Z4,0)+IFERROR('CashFlow Second PY'!O4/'CashFlow Second PY'!$Z4,0))/2))","v":0},{"$f":"IF(VLOOKUP(H$1,Table1[[Month]:[Actuals Month]],3,FALSE),'CashFlow Projection Yr'!P4,ABS((IFERROR('CashFlow PY'!P4/'CashFlow PY'!$Z4,0)+IFERROR('CashFlow Second PY'!P4/'CashFlow Second PY'!$Z4,0))/2))","v":0},{"$f":"IF(VLOOKUP(I$1,Table1[[Month]:[Actuals Month]],3,FALSE),'CashFlow Projection Yr'!Q4,ABS((IFERROR('CashFlow PY'!Q4/'CashFlow PY'!$Z4,0)+IFERROR('CashFlow Second PY'!Q4/'CashFlow Second PY'!$Z4,0))/2))","v":0},{"$f":"IF(VLOOKUP(J$1,Table1[[Month]:[Actuals Month]],3,FALSE),'CashFlow Projection Yr'!R4,ABS((IFERROR('CashFlow PY'!R4/'CashFlow PY'!$Z4,0)+IFERROR('CashFlow Second PY'!R4/'CashFlow Second PY'!$Z4,0))/2))","v":0},{"$f":"IF(VLOOKUP(K$1,Table1[[Month]:[Actuals Month]],3,FALSE),'CashFlow Projection Yr'!S4,ABS((IFERROR('CashFlow PY'!S4/'CashFlow PY'!$Z4,0)+IFERROR('CashFlow Second PY'!S4/'CashFlow Second PY'!$Z4,0))/2))","v":0},{"$f":"IF(VLOOKUP(L$1,Table1[[Month]:[Actuals Month]],3,FALSE),'CashFlow Projection Yr'!T4,ABS((IFERROR('CashFlow PY'!T4/'CashFlow PY'!$Z4,0)+IFERROR('CashFlow Second PY'!T4/'CashFlow Second PY'!$Z4,0))/2))","v":0},{"$f":"IF(VLOOKUP(M$1,Table1[[Month]:[Actuals Month]],3,FALSE),'CashFlow Projection Yr'!U4,ABS((IFERROR('CashFlow PY'!U4/'CashFlow PY'!$Z4,0)+IFERROR('CashFlow Second PY'!U4/'CashFlow Second PY'!$Z4,0))/2))","v":0},{"$f":"IF(VLOOKUP(N$1,Table1[[Month]:[Actuals Month]],3,FALSE),'CashFlow Projection Yr'!V4,ABS((IFERROR('CashFlow PY'!V4/'CashFlow PY'!$Z4,0)+IFERROR('CashFlow Second PY'!V4/'CashFlow Second PY'!$Z4,0))/2))","v":0},{"$f":"IF(VLOOKUP(O$1,Table1[[Month]:[Actuals Month]],3,FALSE),'CashFlow Projection Yr'!W4,ABS((IFERROR('CashFlow PY'!W4/'CashFlow PY'!$Z4,0)+IFERROR('CashFlow Second PY'!W4/'CashFlow Second PY'!$Z4,0))/2))","v":0},{"$f":"SUM(IF(ReportingPeriod = \"NONE\", $D4:$O4,IF(ReportingPeriod = \"June\",0,INDIRECT(ADDRESS(ROW(),MATCH(ReportingPeriod,$D$1:$O$1,0)+4,3)):$O4)))","v":0}]
["8020-8079","     Property Taxes",null,{"$f":"IF(VLOOKUP(D$1,Table1[[Month]:[Actuals Month]],3,FALSE),'CashFlow Projection Yr'!L5,ABS((IFERROR('CashFlow PY'!L5/'CashFlow PY'!$Z5,0)+IFERROR('CashFlow Second PY'!L5/'CashFlow Second PY'!$Z5,0))/2))","v":0},{"$f":"IF(VLOOKUP(E$1,Table1[[Month]:[Actuals Month]],3,FALSE),'CashFlow Projection Yr'!M5,ABS((IFERROR('CashFlow PY'!M5/'CashFlow PY'!$Z5,0)+IFERROR('CashFlow Second PY'!M5/'CashFlow Second PY'!$Z5,0))/2))","v":0},{"$f":"IF(VLOOKUP(F$1,Table1[[Month]:[Actuals Month]],3,FALSE),'CashFlow Projection Yr'!N5,ABS((IFERROR('CashFlow PY'!N5/'CashFlow PY'!$Z5,0)+IFERROR('CashFlow Second PY'!N5/'CashFlow Second PY'!$Z5,0))/2))","v":0},{"$f":"IF(VLOOKUP(G$1,Table1[[Month]:[Actuals Month]],3,FALSE),'CashFlow Projection Yr'!O5,ABS((IFERROR('CashFlow PY'!O5/'CashFlow PY'!$Z5,0)+IFERROR('CashFlow Second PY'!O5/'CashFlow Second PY'!$Z5,0))/2))","v":0},{"$f":"IF(VLOOKUP(H$1,Table1[[Month]:[Actuals Month]],3,FALSE),'CashFlow Projection Yr'!P5,ABS((IFERROR('CashFlow PY'!P5/'CashFlow PY'!$Z5,0)+IFERROR('CashFlow Second PY'!P5/'CashFlow Second PY'!$Z5,0))/2))","v":0},{"$f":"IF(VLOOKUP(I$1,Table1[[Month]:[Actuals Month]],3,FALSE),'CashFlow Projection Yr'!Q5,ABS((IFERROR('CashFlow PY'!Q5/'CashFlow PY'!$Z5,0)+IFERROR('CashFlow Second PY'!Q5/'CashFlow Second PY'!$Z5,0))/2))","v":0},{"$f":"IF(VLOOKUP(J$1,Table1[[Month]:[Actuals Month]],3,FALSE),'CashFlow Projection Yr'!R5,ABS((IFERROR('CashFlow PY'!R5/'CashFlow PY'!$Z5,0)+IFERROR('CashFlow Second PY'!R5/'CashFlow Second PY'!$Z5,0))/2))","v":0},{"$f":"IF(VLOOKUP(K$1,Table1[[Month]:[Actuals Month]],3,FALSE),'CashFlow Projection Yr'!S5,ABS((IFERROR('CashFlow PY'!S5/'CashFlow PY'!$Z5,0)+IFERROR('CashFlow Second PY'!S5/'CashFlow Second PY'!$Z5,0))/2))","v":0},{"$f":"IF(VLOOKUP(L$1,Table1[[Month]:[Actuals Month]],3,FALSE),'CashFlow Projection Yr'!T5,ABS((IFERROR('CashFlow PY'!T5/'CashFlow PY'!$Z5,0)+IFERROR('CashFlow Second PY'!T5/'CashFlow Second PY'!$Z5,0))/2))","v":0},{"$f":"IF(VLOOKUP(M$1,Table1[[Month]:[Actuals Month]],3,FALSE),'CashFlow Projection Yr'!U5,ABS((IFERROR('CashFlow PY'!U5/'CashFlow PY'!$Z5,0)+IFERROR('CashFlow Second PY'!U5/'CashFlow Second PY'!$Z5,0))/2))","v":0},{"$f":"IF(VLOOKUP(N$1,Table1[[Month]:[Actuals Month]],3,FALSE),'CashFlow Projection Yr'!V5,ABS((IFERROR('CashFlow PY'!V5/'CashFlow PY'!$Z5,0)+IFERROR('CashFlow Second PY'!V5/'CashFlow Second PY'!$Z5,0))/2))","v":0},{"$f":"IF(VLOOKUP(O$1,Table1[[Month]:[Actuals Month]],3,FALSE),'CashFlow Projection Yr'!W5,ABS((IFERROR('CashFlow PY'!W5/'CashFlow PY'!$Z5,0)+IFERROR('CashFlow Second PY'!W5/'CashFlow Second PY'!$Z5,0))/2))","v":0},{"$f":"SUM(IF(ReportingPeriod = \"NONE\", $D5:$O5,IF(ReportingPeriod = \"June\",0,INDIRECT(ADDRESS(ROW(),MATCH(ReportingPeriod,$D$1:$O$1,0)+4,3)):$O5)))","v":0}]
["8080-8099","     Misc Funds",null,{"$f":"IF(VLOOKUP(D$1,Table1[[Month]:[Actuals Month]],3,FALSE),'CashFlow Projection Yr'!L6,ABS((IFERROR('CashFlow PY'!L6/'CashFlow PY'!$Z6,0)+IFERROR('CashFlow Second PY'!L6/'CashFlow Second PY'!$Z6,0))/2))","v":0},{"$f":"IF(VLOOKUP(E$1,Table1[[Month]:[Actuals Month]],3,FALSE),'CashFlow Projection Yr'!M6,ABS((IFERROR('CashFlow PY'!M6/'CashFlow PY'!$Z6,0)+IFERROR('CashFlow Second PY'!M6/'CashFlow Second PY'!$Z6,0))/2))","v":0},{"$f":"IF(VLOOKUP(F$1,Table1[[Month]:[Actuals Month]],3,FALSE),'CashFlow Projection Yr'!N6,ABS((IFERROR('CashFlow PY'!N6/'CashFlow PY'!$Z6,0)+IFERROR('CashFlow Second PY'!N6/'CashFlow Second PY'!$Z6,0))/2))","v":0},{"$f":"IF(VLOOKUP(G$1,Table1[[Month]:[Actuals Month]],3,FALSE),'CashFlow Projection Yr'!O6,ABS((IFERROR('CashFlow PY'!O6/'CashFlow PY'!$Z6,0)+IFERROR('CashFlow Second PY'!O6/'CashFlow Second PY'!$Z6,0))/2))","v":0},{"$f":"IF(VLOOKUP(H$1,Table1[[Month]:[Actuals Month]],3,FALSE),'CashFlow Projection Yr'!P6,ABS((IFERROR('CashFlow PY'!P6/'CashFlow PY'!$Z6,0)+IFERROR('CashFlow Second PY'!P6/'CashFlow Second PY'!$Z6,0))/2))","v":0},{"$f":"IF(VLOOKUP(I$1,Table1[[Month]:[Actuals Month]],3,FALSE),'CashFlow Projection Yr'!Q6,ABS((IFERROR('CashFlow PY'!Q6/'CashFlow PY'!$Z6,0)+IFERROR('CashFlow Second PY'!Q6/'CashFlow Second PY'!$Z6,0))/2))","v":0},{"$f":"IF(VLOOKUP(J$1,Table1[[Month]:[Actuals Month]],3,FALSE),'CashFlow Projection Yr'!R6,ABS((IFERROR('CashFlow PY'!R6/'CashFlow PY'!$Z6,0)+IFERROR('CashFlow Second PY'!R6/'CashFlow Second PY'!$Z6,0))/2))","v":0},{"$f":"IF(VLOOKUP(K$1,Table1[[Month]:[Actuals Month]],3,FALSE),'CashFlow Projection Yr'!S6,ABS((IFERROR('CashFlow PY'!S6/'CashFlow PY'!$Z6,0)+IFERROR('CashFlow Second PY'!S6/'CashFlow Second PY'!$Z6,0))/2))","v":0},{"$f":"IF(VLOOKUP(L$1,Table1[[Month]:[Actuals Month]],3,FALSE),'CashFlow Projection Yr'!T6,ABS((IFERROR('CashFlow PY'!T6/'CashFlow PY'!$Z6,0)+IFERROR('CashFlow Second PY'!T6/'CashFlow Second PY'!$Z6,0))/2))","v":0},{"$f":"IF(VLOOKUP(M$1,Table1[[Month]:[Actuals Month]],3,FALSE),'CashFlow Projection Yr'!U6,ABS((IFERROR('CashFlow PY'!U6/'CashFlow PY'!$Z6,0)+IFERROR('CashFlow Second PY'!U6/'CashFlow Second PY'!$Z6,0))/2))","v":0},{"$f":"IF(VLOOKUP(N$1,Table1[[Month]:[Actuals Month]],3,FALSE),'CashFlow Projection Yr'!V6,ABS((IFERROR('CashFlow PY'!V6/'CashFlow PY'!$Z6,0)+IFERROR('CashFlow Second PY'!V6/'CashFlow Second PY'!$Z6,0))/2))","v":0},{"$f":"IF(VLOOKUP(O$1,Table1[[Month]:[Actuals Month]],3,FALSE),'CashFlow Projection Yr'!W6,ABS((IFERROR('CashFlow PY'!W6/'CashFlow PY'!$Z6,0)+IFERROR('CashFlow Second PY'!W6/'CashFlow Second PY'!$Z6,0))/2))","v":0},{"$f":"SUM(IF(ReportingPeriod = \"NONE\", $D6:$O6,IF(ReportingPeriod = \"June\",0,INDIRECT(ADDRESS(ROW(),MATCH(ReportingPeriod,$D$1:$O$1,0)+4,3)):$O6)))","v":0}]
{"$rows_left_out":40}
{"sheet":"CashFlow Projection Yr","index":4,"n_rows":1,"n_cols":28,"rows_kept":1,"cut":false,"hidden":false,"merged":[]}
["Fiscalyr","DistrictNo","DistrictName","Fund","FundTitle","ResourceTitle","Cat","ReportRow","ObjectText","Title","Beg Balance","July","August","September","October","November","December","January","February","March","April","May","June","Accruals","Adjustments","TOTAL","BUDGET","Budget Diff"]

{"sheet":"CashFlow PY","index":5,"n_rows":1,"n_cols":28,"rows_kept":1,"cut":false,"hidden":false,"merged":[]}
["Fiscalyr","DistrictNo","DistrictName","Fund","FundTitle","ResourceTitle","Cat","ReportRow","ObjectText","Title","Beg Balance","July","August","September","October","November","December","January","February","March","April","May","June","Accruals","Adjustments","TOTAL","BUDGET","Budget Diff"]

{"sheet":"CashFlow Second PY","index":6,"n_rows":1,"n_cols":28,"rows_kept":1,"cut":false,"hidden":false,"merged":[]}
["Fiscalyr","DistrictNo","DistrictName","Fund","FundTitle","ResourceTitle","Cat","ReportRow","ObjectText","Title","Beg Balance","July","August","September","October","November","December","January","February","March","April","May","June","Accruals","Adjustments","TOTAL","BUDGET","Budget Diff"]